BDBM50297227 (S)-2-(4'-(4-(1-methoxy-2-methyl-1-oxopropan-2-yloxy)-3-methylbenzofuran-2-carboxamido)biphenyl-4-ylsulfonamido)-3-methylbutanoic acid::CHEMBL541447
SMILES COC(=O)C(C)(C)Oc1cccc2oc(C(=O)Nc3ccc(cc3)-c3ccc(cc3)S(=O)(=O)N[C@@H](C(C)C)C(O)=O)c(C)c12
InChI Key InChIKey=DMMXGBRKSOTFSC-MHZLTWQESA-N
Data  2 IC50
  Tab Delimited (TSV)   2D SDfile   Computed 3D by Vconf -m prep SDfile
Find this compound or compounds like it in BindingDB:
Activity Spreadsheet -- Enzyme Inhibition Constant Data from BindingDB
Found 2 hits for monomerid = 50297227
Target72 kDa type IV collagenase(Homo sapiens (Human))
Wyeth Research
Curated by ChEMBL
LigandPNGBDBM50297227((S)-2-(4'-(4-(1-methoxy-2-methyl-1-oxopropan-2-ylo...)
Affinity DataIC50:  6.20E+3nM. Assay description: Inhibition of MMP2
In DepthDetails ArticlePubMed
TargetCollagenase 3(Homo sapiens (Human))
Wyeth Research
Curated by ChEMBL
LigandPNGBDBM50297227((S)-2-(4'-(4-(1-methoxy-2-methyl-1-oxopropan-2-ylo...)
Affinity DataIC50:  25nM. Assay description: Inhibition of MMP13
In DepthDetails ArticlePubMed