BDBM50297245 (S)-3-methyl-2-(4-(5-(4-(methylsulfonamido)benzofuran-2-carboxamido)pyridin-2-yl)phenylsulfonamido)butanoic acid::CHEMBL562607
SMILES CC(C)[C@H](NS(=O)(=O)c1ccc(cc1)-c1ccc(NC(=O)c2cc3c(NS(C)(=O)=O)cccc3o2)cn1)C(O)=O
InChI Key InChIKey=WXFYHQKQOWMEDX-DEOSSOPVSA-N
Data  2 IC50
  Tab Delimited (TSV)   2D SDfile   Computed 3D by Vconf -m prep SDfile
Find this compound or compounds like it in BindingDB:
Activity Spreadsheet -- Enzyme Inhibition Constant Data from BindingDB
Found 2 hits for monomerid = 50297245
Target72 kDa type IV collagenase(Homo sapiens (Human))
Wyeth Research
Curated by ChEMBL
LigandPNGBDBM50297245((S)-3-methyl-2-(4-(5-(4-(methylsulfonamido)benzofu...)
Affinity DataIC50:  7.50E+3nM. Assay description: Inhibition of MMP2
In DepthDetails ArticlePubMed
TargetCollagenase 3(Homo sapiens (Human))
Wyeth Research
Curated by ChEMBL
LigandPNGBDBM50297245((S)-3-methyl-2-(4-(5-(4-(methylsulfonamido)benzofu...)
Affinity DataIC50:  40nM. Assay description: Inhibition of MMP13
In DepthDetails ArticlePubMed