BDBM50298392 (+/-)-9-Amino-1-cyclopropyl-oxazolo[4,5-b]-6-ethyl-3,4,7,8-tetrahydro-6,10-methano cycloocta[e]pyridine::CHEMBL584003
SMILES CCC1=CC2CC(C1)c1c(C2)nc2oc(nc2c1N)C1CC1
InChI Key InChIKey=NZACCWNTPPQGKU-UHFFFAOYSA-N
Data  1 IC50
  Tab Delimited (TSV)   2D SDfile   Computed 3D by Vconf -m prep SDfile
Find this compound or compounds like it in BindingDB:
Activity Spreadsheet -- Enzyme Inhibition Constant Data from BindingDB
Found 1 hit for monomerid = 50298392
TargetAcetylcholinesterase(Homo sapiens (Human))
Cobra
Curated by ChEMBL
LigandPNGBDBM50298392((+/-)-9-Amino-1-cyclopropyl-oxazolo[4,5-b]-6-ethyl...)
Affinity DataIC50:  5.00E+4nM. Assay description: Inhibition of human recombinant AChE in erythrocytes by Ellman's assay
In DepthDetails ArticlePubMed