BDBM50299587 1-(5-methyl-7H-pyrrolo[2,3-d]pyrimidin-4-yl)-N-phenylpiperidine-4-carboxamide::CHEMBL570598
SMILES Cc1c[nH]c2ncnc(N3CCC(CC3)C(=O)Nc3ccccc3)c12
InChI Key InChIKey=VHPPTKHCXNGNDC-UHFFFAOYSA-N
Data  1 IC50
  Tab Delimited (TSV)   2D SDfile   Computed 3D by Vconf -m prep SDfile
Find this compound or compounds like it in BindingDB:
Activity Spreadsheet -- Enzyme Inhibition Constant Data from BindingDB
Found 1 hit for monomerid = 50299587
TargetLIM domain kinase 2(Homo sapiens (Human))
Lexicon Pharmaceuticals
Curated by ChEMBL
LigandPNGBDBM50299587(1-(5-methyl-7H-pyrrolo[2,3-d]pyrimidin-4-yl)-N-phe...)
Affinity DataIC50:  800nM. Assay description: Inhibition of human recombinant LIMK2 expressed in baculovirus-Sf9 system by scintillation counting
In DepthDetails ArticlePubMed