BDBM50299599 (S)-N-(3-bromophenyl)-2-methyl-4-(5-methyl-7H-pyrrolo[2,3-d]pyrimidin-4-yl)piperazine-1-carboxamide::CHEMBL571942
SMILES C[C@H]1CN(CCN1C(=O)Nc1cccc(Br)c1)c1ncnc2[nH]cc(C)c12
InChI Key InChIKey=CPJGIRFFPLPFGW-ZDUSSCGKSA-N
Data  1 IC50
  Tab Delimited (TSV)   2D SDfile   Computed 3D by Vconf -m prep SDfile
Find this compound or compounds like it in BindingDB:
Activity Spreadsheet -- Enzyme Inhibition Constant Data from BindingDB
Found 1 hit for monomerid = 50299599
TargetLIM domain kinase 2(Homo sapiens (Human))
Lexicon Pharmaceuticals
Curated by ChEMBL
LigandPNGBDBM50299599((S)-N-(3-bromophenyl)-2-methyl-4-(5-methyl-7H-pyrr...)
Affinity DataIC50:  3.90nM. Assay description: Inhibition of human recombinant LIMK2 expressed in baculovirus-Sf9 system by scintillation counting
In DepthDetails ArticlePubMed