BDBM50300072 CHEMBL573202::methyl 4-(4-(3-oxa-8-azabicyclo[3.2.1]octan-8-yl)-6-(4-(3-pyridin-3-ylureido)phenyl)-1H-pyrazolo[3,4-d]pyrimidin-1-yl)piperidine-1-carboxylate
SMILES COC(=O)N1CCC(CC1)n1ncc2c(nc(nc12)-c1ccc(NC(=O)Nc2cccnc2)cc1)N1C2CCC1COC2
InChI Key InChIKey=YCSUYVMGFIAGHE-UHFFFAOYSA-N
Data  2 IC50
  Tab Delimited (TSV)   2D SDfile   Computed 3D by Vconf -m prep SDfile
Find this compound or compounds like it in BindingDB:
Activity Spreadsheet -- Enzyme Inhibition Constant Data from BindingDB
Found 2 hits for monomerid = 50300072
LigandPNGBDBM50300072(CHEMBL573202 | methyl 4-(4-(3-oxa-8-azabicyclo[3.2...)
Affinity DataIC50:  1.83E+3nM. Assay description: Inhibition of PI3Kalpha
In DepthDetails ArticlePubMed
TargetSerine/threonine-protein kinase mTOR(Homo sapiens (Human))
Wyeth Research
Curated by ChEMBL
LigandPNGBDBM50300072(CHEMBL573202 | methyl 4-(4-(3-oxa-8-azabicyclo[3.2...)
Affinity DataIC50:  0.160nM. Assay description: Inhibition of Flag-tagged human mTOR by DELFIA method
In DepthDetails ArticlePubMed