BDBM50300539 CHEMBL573430::N-((2R,3R)-2-(benzo[d][1,3]dioxol-5-yl)-3-((4S,5S)-5-((tert-butyldimethylsilyloxy)methyl)-2,2-dimethyl-1,3-dioxolan-4-yl)-3-(methoxymethoxy)propyl)benzamide::[(2R,3R,4S,5S)-2-(3',4'-Methylenedioxy)phenyl-3-methoxymethyleneoxy-4,5-isopropylidene-dioxy-6-tert-butyldimethylsilyloxy]hexylbenzamide
SMILES COCO[C@H]([C@@H](CNC(=O)c1ccccc1)c1ccc2OCOc2c1)[C@@H]1OC(C)(C)O[C@H]1CO[Si](C)(C)C(C)(C)C
InChI Key InChIKey=PSRRUEPWXFJQOG-DXXRHUJXSA-N
Data  1 KI
  Tab Delimited (TSV)   2D SDfile   Computed 3D by Vconf -m prep SDfile
Find this compound or compounds like it in BindingDB:
Activity Spreadsheet -- Enzyme Inhibition Constant Data from BindingDB
Found 1 hit for monomerid = 50300539
TargetCytochrome P450 3A4(Homo sapiens (Human))
Mcmaster University
Curated by ChEMBL
LigandPNGBDBM50300539(CHEMBL573430 | N-((2R,3R)-2-(benzo[d][1,3]dioxol-5...)
Affinity DataKi:  30nM. Assay description: Inhibition of human recombinant CYP3A4 assessed as biotransformation of 7-benzyloxyquinoline to 7-hydroxyquinoline measured every 15 mins by fluoresc...
In DepthDetails ArticlePubMed