BDBM50300721 8-(4-methoxyphenyl)-8-(3-(pyrimidin-5-yl)phenyl)-2,3,4,8-tetrahydroimidazo[1,5-a]pyrimidin-6-amine::CHEMBL582828
SMILES COc1ccc(cc1)C1(N=C(N)N2CCCN=C12)c1cccc(c1)-c1cncnc1
InChI Key InChIKey=LSPPQVUEXNMTCS-UHFFFAOYSA-N
Data  4 IC50  1 EC50
  Tab Delimited (TSV)   2D SDfile   Computed 3D by Vconf -m prep SDfile
Find this compound or compounds like it in BindingDB:
Activity Spreadsheet -- Enzyme Inhibition Constant Data from BindingDB
Found 5 hits for monomerid = 50300721
TargetBeta-secretase 1(Homo sapiens (Human))
Wyeth Research
Curated by ChEMBL
LigandPNGBDBM50300721(8-(4-methoxyphenyl)-8-(3-(pyrimidin-5-yl)phenyl)-2...)
Affinity DataIC50:  100nM. Assay description: Inhibition of human BACE1 by FRET
In DepthDetails ArticlePubMed
TargetBeta-secretase 1(Homo sapiens (Human))
Wyeth Research
Curated by ChEMBL
LigandPNGBDBM50300721(8-(4-methoxyphenyl)-8-(3-(pyrimidin-5-yl)phenyl)-2...)
Affinity DataEC50:  1.40E+3nM. Assay description: Inhibition of BACE1 expressed in CHO cells co-expressing human wild type APP protein by ELISA
In DepthDetails ArticlePubMed
TargetBeta-secretase 2(Homo sapiens (Human))
Wyeth Research
Curated by ChEMBL
LigandPNGBDBM50300721(8-(4-methoxyphenyl)-8-(3-(pyrimidin-5-yl)phenyl)-2...)
Affinity DataIC50:  1.62E+4nM. Assay description: Inhibition of human BACE2 by FRET
In DepthDetails ArticlePubMed
TargetCathepsin D(Homo sapiens (Human))
Wyeth Research
Curated by ChEMBL
LigandPNGBDBM50300721(8-(4-methoxyphenyl)-8-(3-(pyrimidin-5-yl)phenyl)-2...)
Affinity DataIC50:  6.95E+4nM. Assay description: Inhibition of human cathepsin D by FRET
In DepthDetails ArticlePubMed
TargetBeta-secretase 1(Homo sapiens (Human))
Wyeth Research
Curated by ChEMBL
LigandPNGBDBM50300721(8-(4-methoxyphenyl)-8-(3-(pyrimidin-5-yl)phenyl)-2...)
Affinity DataIC50:  91nM. Assay description: Inhibition of human BACE-1 using (Eu)CEVNLDAEFK(Qsy7) as substrate preincubated for 10 mins prior substrate addition measured after 15 mins by FRET-b...
In DepthDetails ArticlePubMed