BDBM50301713 (1R,2R)-2-(5-(3-hydroxyphenyl)isoxazol-3-yl)-N-(1-phenylcyclobutyl)cyclopentanecarboxamide::CHEMBL566259
SMILES Oc1cccc(c1)-c1cc(no1)[C@@H]1CCC[C@H]1C(=O)NC1(CCC1)c1ccccc1
InChI Key InChIKey=LKGXQEPWUQBIDS-NHCUHLMSSA-N
Data  1 IC50
  Tab Delimited (TSV)   2D SDfile   Computed 3D by Vconf -m prep SDfile
Find this compound or compounds like it in BindingDB:
Activity Spreadsheet -- Enzyme Inhibition Constant Data from BindingDB
Found 1 hit for monomerid = 50301713
TargetSodium channel protein type 9 subunit alpha(Homo sapiens (Human))
Merck Research Laboratories
Curated by ChEMBL
LigandPNGBDBM50301713((1R,2R)-2-(5-(3-hydroxyphenyl)isoxazol-3-yl)-N-(1-...)
Affinity DataIC50:  210nM. Assay description: Inhibition of human Nav1.7 channel expressed in HEK293 cells by FRET assay
In DepthDetails ArticlePubMed