BDBM50304087 CHEMBL596036::N-(4-(2-(3-(3,4-Dichlorophenyl)-2-oxoimidazolidin-1-yl)ethoxy)phenyl)methanesulfonamide
SMILES CS(=O)(=O)Nc1ccc(OCCN2CCN(C2=O)c2ccc(Cl)c(Cl)c2)cc1
InChI Key InChIKey=FKDIDCUKBIATHN-UHFFFAOYSA-N
Data  1 KI
  Tab Delimited (TSV)   2D SDfile   Computed 3D by Vconf -m prep SDfile
Find this compound or compounds like it in BindingDB:
Activity Spreadsheet -- Enzyme Inhibition Constant Data from BindingDB
Found 1 hit for monomerid = 50304087
TargetGlutamate receptor ionotropic, NMDA 2B(Rattus norvegicus (Rat))
Emory University
Curated by ChEMBL
LigandPNGBDBM50304087(CHEMBL596036 | N-(4-(2-(3-(3,4-Dichlorophenyl)-2-o...)
Affinity DataKi:  300nM. Assay description: Displacement of [3H]ifenprodil form NR2B receptor in Wistar rat cerebral cortex membrane
In DepthDetails ArticlePubMed