BDBM50305559 CHEMBL594445::N-(5-bromothiazol-2-ylcarbamoyl)-5-chlorothiophene-2-sulfonamide
SMILES Clc1ccc(s1)S(=O)(=O)NC(=O)Nc1ncc(Br)s1
InChI Key InChIKey=LGWYGKDXWKKKBD-UHFFFAOYSA-N
Data  2 IC50  1 EC50
  Tab Delimited (TSV)   2D SDfile   Computed 3D by Vconf -m prep SDfile
Find this compound or compounds like it in BindingDB:
Activity Spreadsheet -- Enzyme Inhibition Constant Data from BindingDB
Found 1 hit for monomerid = 50305559
TargetFructose-1,6-bisphosphatase 1(Mus musculus)
F. Hoffmann-La Roche
Curated by ChEMBL
LigandPNGBDBM50305559(CHEMBL594445 | N-(5-bromothiazol-2-ylcarbamoyl)-5-...)
Affinity DataEC50:  9.20E+4nM. Assay description: Inhibition of FBPase in mouse liver
In DepthDetails ArticlePubMed