BDBM50308225 2-Anilino-5,7-dihydro-6H-pyrimido[5,4-d][1]benzazepin-6-one::CHEMBL603255
SMILES O=C1Cc2cnc(Nc3ccccc3)nc2-c2ccccc2N1
InChI Key InChIKey=IAKSXYZIQGVUIF-UHFFFAOYSA-N
Data  3 IC50
  Tab Delimited (TSV)   2D SDfile   Computed 3D by Vconf -m prep SDfile
Find this compound or compounds like it in BindingDB:
Activity Spreadsheet -- Enzyme Inhibition Constant Data from BindingDB
Found 3 hits for monomerid = 50308225
TargetVascular endothelial growth factor receptor 2(Homo sapiens (Human))
Technische Universitat Braunschweig
Curated by ChEMBL
LigandPNGBDBM50308225(2-Anilino-5,7-dihydro-6H-pyrimido[5,4-d][1]benzaze...)
Affinity DataIC50:  140nM. Assay description: Inhibition of VEGFR2 assessed as [33Pi] incorporation by microplate scintillation counting in presence of 1 uM ATP
In DepthDetails ArticlePubMed
TargetInsulin receptor(Homo sapiens (Human))
Technische Universitat Braunschweig
Curated by ChEMBL
LigandPNGBDBM50308225(2-Anilino-5,7-dihydro-6H-pyrimido[5,4-d][1]benzaze...)
Affinity DataIC50: >1.00E+5nM. Assay description: Inhibition of INSR assessed as [33Pi] incorporation by microplate scintillation counting in presence of 1 uM ATP
In DepthDetails ArticlePubMed
TargetSerine/threonine-protein kinase PLK1(Homo sapiens (Human))
Technische Universitat Braunschweig
Curated by ChEMBL
LigandPNGBDBM50308225(2-Anilino-5,7-dihydro-6H-pyrimido[5,4-d][1]benzaze...)
Affinity DataIC50: >1.00E+5nM. Assay description: Inhibition of PLK1 assessed as [33Pi] incorporation by microplate scintillation counting in presence of 1 uM ATP
In DepthDetails ArticlePubMed