BDBM50308231 2-(4-Hydroxyanilino)-5,7-dihydro-6H-pyrimido[5,4-d][1]benzazepin-6-one::CHEMBL605841
SMILES Oc1ccc(Nc2ncc3CC(=O)Nc4ccccc4-c3n2)cc1
InChI Key InChIKey=UJPRBQDQQHDOGH-UHFFFAOYSA-N
Data  3 IC50
  Tab Delimited (TSV)   2D SDfile   Computed 3D by Vconf -m prep SDfile
Find this compound or compounds like it in BindingDB:
Activity Spreadsheet -- Enzyme Inhibition Constant Data from BindingDB
Found 3 hits for monomerid = 50308231
TargetVascular endothelial growth factor receptor 2(Homo sapiens (Human))
Technische Universitat Braunschweig
Curated by ChEMBL
LigandPNGBDBM50308231(2-(4-Hydroxyanilino)-5,7-dihydro-6H-pyrimido[5,4-d...)
Affinity DataIC50:  80nM. Assay description: Inhibition of VEGFR2 assessed as [33Pi] incorporation by microplate scintillation counting in presence of 1 uM ATP
In DepthDetails ArticlePubMed
TargetInsulin receptor(Homo sapiens (Human))
Technische Universitat Braunschweig
Curated by ChEMBL
LigandPNGBDBM50308231(2-(4-Hydroxyanilino)-5,7-dihydro-6H-pyrimido[5,4-d...)
Affinity DataIC50: >1.00E+5nM. Assay description: Inhibition of INSR assessed as [33Pi] incorporation by microplate scintillation counting in presence of 1 uM ATP
In DepthDetails ArticlePubMed
TargetSerine/threonine-protein kinase PLK1(Homo sapiens (Human))
Technische Universitat Braunschweig
Curated by ChEMBL
LigandPNGBDBM50308231(2-(4-Hydroxyanilino)-5,7-dihydro-6H-pyrimido[5,4-d...)
Affinity DataIC50: >1.00E+5nM. Assay description: Inhibition of PLK1 assessed as [33Pi] incorporation by microplate scintillation counting in presence of 1 uM ATP
In DepthDetails ArticlePubMed