BDBM50309671 (2S,6S,2R)-2-[6-(2-(2-Thiophen)-carboxyl-2-phenylethyl)-1-methylpiperidin-2-yl]-1-phenylethanone hydrochloride::CHEMBL606378
SMILES CN1[C@H](C[C@H](OC(=O)c2cccs2)c2ccccc2)CCC[C@@H]1CC(=O)c1ccccc1
InChI Key InChIKey=ZOSWTNNYZMNHNS-CUYJMHBOSA-N
Data  3 KI
  Tab Delimited (TSV)   2D SDfile   Computed 3D by Vconf -m prep SDfile
Find this compound or compounds like it in BindingDB:
Activity Spreadsheet -- Enzyme Inhibition Constant Data from BindingDB
Found 3 hits for monomerid = 50309671
TargetSodium-dependent dopamine transporter(Rattus norvegicus (rat))
University Of Kentucky
Curated by ChEMBL
LigandPNGBDBM50309671((2S,6S,2R)-2-[6-(2-(2-Thiophen)-carboxyl-2-phenyle...)
Affinity DataKi:  3.02E+3nM. Assay description: Inhibition of [3H]DA uptake at DAT in rat brain striatal synaptosomes by liquid scintillation spectrophotometry
In DepthDetails ArticlePubMed
TargetSynaptic vesicular amine transporter(Rattus norvegicus (Rat))
University Of Kentucky
Curated by ChEMBL
LigandPNGBDBM50309671((2S,6S,2R)-2-[6-(2-(2-Thiophen)-carboxyl-2-phenyle...)
Affinity DataKi:  6.37E+3nM. Assay description: Displacement of [3H]MTBZ from VMAT2 in rat whole brain vesicles by liquid scintillation spectrophotometry
In DepthDetails ArticlePubMed
TargetSodium-dependent serotonin transporter(Rattus norvegicus (rat))
University Of Kentucky
Curated by ChEMBL
LigandPNGBDBM50309671((2S,6S,2R)-2-[6-(2-(2-Thiophen)-carboxyl-2-phenyle...)
Affinity DataKi:  9.70E+3nM. Assay description: Inhibition of [3H]5HT uptake at SERT in rat brain hippocampal synaptosomes by liquid scintillation spectrophotometry
In DepthDetails ArticlePubMed