BDBM50310952 1-benzyl-4-(benzyloxy)-3-iodopyridin-2(1H)-one::CHEMBL1078022
SMILES Ic1c(OCc2ccccc2)ccn(Cc2ccccc2)c1=O
InChI Key InChIKey=NEZIZFKTRZDBMW-UHFFFAOYSA-N
Data  2 IC50
  Tab Delimited (TSV)   2D SDfile   Computed 3D by Vconf -m prep SDfile
Find this compound or compounds like it in BindingDB:
Activity Spreadsheet -- Enzyme Inhibition Constant Data from BindingDB
Found 2 hits for monomerid = 50310952
TargetMitogen-activated protein kinase 9(Homo sapiens (Human))
Pfizer
Curated by ChEMBL
LigandPNGBDBM50310952(1-benzyl-4-(benzyloxy)-3-iodopyridin-2(1H)-one | C...)
Affinity DataIC50: >2.00E+5nM. Assay description: Inhibition of JNK2
In DepthDetails ArticlePubMed
TargetMitogen-activated protein kinase 14(Homo sapiens (Human))
Pfizer
Curated by ChEMBL
LigandPNGBDBM50310952(1-benzyl-4-(benzyloxy)-3-iodopyridin-2(1H)-one | C...)
Affinity DataIC50:  3.10E+3nM. Assay description: Inhibition of p38alpha
In DepthDetails ArticlePubMed