BDBM50311610 4,5-dichloro-N-(5-(1-(2,4-dichlorobenzyl)-5-fluoro-3-methyl-1H-indol-7-yl)pyridin-2-yl)thiophene-2-sulfonamide::CHEMBL1080619
SMILES Cc1cn(Cc2ccc(Cl)cc2Cl)c2c(cc(F)cc12)-c1ccc(NS(=O)(=O)c2cc(Cl)c(Cl)s2)nc1
InChI Key InChIKey=IMJQBYPSOUJJAJ-UHFFFAOYSA-N
Data  1 IC50
  Tab Delimited (TSV)   2D SDfile   Computed 3D by Vconf -m prep SDfile
Find this compound or compounds like it in BindingDB:
Activity Spreadsheet -- Enzyme Inhibition Constant Data from BindingDB
Found 1 hit for monomerid = 50311610
TargetProstaglandin E2 receptor EP3 subtype(Homo sapiens (Human))
Decode Chemistry
Curated by ChEMBL
LigandPNGBDBM50311610(4,5-dichloro-N-(5-(1-(2,4-dichlorobenzyl)-5-fluoro...)
Affinity DataIC50:  2nM. Assay description: Displacement of [3H]PGE2 from human EP3 receptor
In DepthDetails ArticlePubMed