BDBM50311620 3,4-dichloro-N-(5-(5-fluoro-3-methyl-1-(naphthalen-2-ylmethyl)-1H-indol-7-yl)isoxazol-3-yl)benzenesulfonamide::CHEMBL1079381
SMILES Cc1cn(Cc2ccc3ccccc3c2)c2c(cc(F)cc12)-c1cc(NS(=O)(=O)c2ccc(Cl)c(Cl)c2)no1
InChI Key InChIKey=HRBJXAZHJSCYJS-UHFFFAOYSA-N
Data  1 IC50
  Tab Delimited (TSV)   2D SDfile   Computed 3D by Vconf -m prep SDfile
Find this compound or compounds like it in BindingDB:
Activity Spreadsheet -- Enzyme Inhibition Constant Data from BindingDB
Found 1 hit for monomerid = 50311620
TargetProstaglandin E2 receptor EP3 subtype(Homo sapiens (Human))
Decode Chemistry
Curated by ChEMBL
LigandPNGBDBM50311620(3,4-dichloro-N-(5-(5-fluoro-3-methyl-1-(naphthalen...)
Affinity DataIC50:  11nM. Assay description: Displacement of [3H]PGE2 from human EP3 receptor
In DepthDetails ArticlePubMed