BDBM50312703 (S)-(4-(chloromethyl)-2-cyclopentyl-5-hydroxy-7,7-dimethyl-5,6,7,8-tetrahydroquinolin-3-yl)(4-(trifluoromethyl)phenyl)methanone::CHEMBL1080385
SMILES CC1(C)C[C@H](O)c2c(CCl)c(C(=O)c3ccc(cc3)C(F)(F)F)c(nc2C1)C1CCCC1
InChI Key InChIKey=PRAISEVVHNSPBH-IBGZPJMESA-N
Data  1 IC50
  Tab Delimited (TSV)   2D SDfile   Computed 3D by Vconf -m prep SDfile
Find this compound or compounds like it in BindingDB:
Activity Spreadsheet -- Enzyme Inhibition Constant Data from BindingDB
Found 1 hit for monomerid = 50312703
TargetCholesteryl ester transfer protein(Homo sapiens (Human))
Bayer Healthcare
Curated by ChEMBL
LigandPNGBDBM50312703((S)-(4-(chloromethyl)-2-cyclopentyl-5-hydroxy-7,7-...)
Affinity DataIC50:  1.50E+4nM. Assay description: Inhibition of CETP assessed as cholesterol ester transfer after 4 hrs by microemulsion based fluorescence assay
In DepthDetails ArticlePubMed