BDBM50312706 (S)-(2-cyclopentyl-5-hydroxy-7,7-dimethyl-4-(piperidin-4-yl)-5,6,7,8-tetrahydroquinolin-3-yl)(4-(trifluoromethyl)phenyl)methanone::CHEMBL1080732
SMILES CC1(C)C[C@H](O)c2c(C1)nc(C1CCCC1)c(C(=O)c1ccc(cc1)C(F)(F)F)c2C1CCNCC1
InChI Key InChIKey=JVAFBDUHJCPZEG-QFIPXVFZSA-N
Data  1 IC50
  Tab Delimited (TSV)   2D SDfile   Computed 3D by Vconf -m prep SDfile
Find this compound or compounds like it in BindingDB:
Activity Spreadsheet -- Enzyme Inhibition Constant Data from BindingDB
Found 1 hit for monomerid = 50312706
TargetCholesteryl ester transfer protein(Homo sapiens (Human))
Bayer Healthcare
Curated by ChEMBL
LigandPNGBDBM50312706((S)-(2-cyclopentyl-5-hydroxy-7,7-dimethyl-4-(piper...)
Affinity DataIC50: >2.00E+4nM. Assay description: Inhibition of CETP assessed as cholesterol ester transfer after 4 hrs by microemulsion based fluorescence assay
In DepthDetails ArticlePubMed