BDBM50312711 (S)-4'-cyclohexyl-3'-((S)-hydroxy(4-(trifluoromethyl)phenyl)methyl)-2'-isopropyl-6',8'-dihydro-5'H-spiro[cyclobutane-1,7'-quinolin]-5'-ol::CHEMBL1080751
SMILES CC(C)c1nc2CC3(CCC3)C[C@H](O)c2c(C2CCCCC2)c1[C@@H](O)c1ccc(cc1)C(F)(F)F
InChI Key InChIKey=UPPJNDFCGIBSES-CUNXSJBXSA-N
Data  1 IC50
  Tab Delimited (TSV)   2D SDfile   Computed 3D by Vconf -m prep SDfile
Find this compound or compounds like it in BindingDB:
Activity Spreadsheet -- Enzyme Inhibition Constant Data from BindingDB
Found 1 hit for monomerid = 50312711
TargetCholesteryl ester transfer protein(Homo sapiens (Human))
Bayer Healthcare
Curated by ChEMBL
LigandPNGBDBM50312711((S)-4'-cyclohexyl-3'-((S)-hydroxy(4-(trifluorometh...)
Affinity DataIC50:  70nM. Assay description: Inhibition of CETP assessed as cholesterol ester transfer after 4 hrs by microemulsion based fluorescence assay
In DepthDetails ArticlePubMed