BDBM50313249 CHEMBL1080215::N-(3-(4-(3-chlorophenyl)piperazin-1-yl)propyl)-2-methyl-5-phenyl-1H-pyrrole-3-carboxamide
SMILES Cc1[nH]c(cc1C(=O)NCCCN1CCN(CC1)c1cccc(Cl)c1)-c1ccccc1
InChI Key InChIKey=HMLUJXHOCKZVCO-UHFFFAOYSA-N
Data  3 IC50
  Tab Delimited (TSV)   2D SDfile   Computed 3D by Vconf -m prep SDfile
Find this compound or compounds like it in BindingDB:
Activity Spreadsheet -- Enzyme Inhibition Constant Data from BindingDB
Found 3 hits for monomerid = 50313249
Target5-hydroxytryptamine receptor 2A(Homo sapiens (Human))
Green Cross
Curated by ChEMBL
LigandPNGBDBM50313249(CHEMBL1080215 | N-(3-(4-(3-chlorophenyl)piperazin-...)
Affinity DataIC50:  245nM. Assay description: Displacement of [3H]ketanserin from human recombinant 5-HT2A receptor expressed in CHO-K1 cells after 60 mins
In DepthDetails ArticlePubMed
TargetSodium-dependent serotonin transporter(Homo sapiens (Human))
Green Cross
Curated by ChEMBL
LigandPNGBDBM50313249(CHEMBL1080215 | N-(3-(4-(3-chlorophenyl)piperazin-...)
Affinity DataIC50:  92nM. Assay description: Displacement of [3H]imipramine from human SERT expressed in HEK293 cells after 30 mins by rapid filtration assay
In DepthDetails ArticlePubMed
Target5-hydroxytryptamine receptor 2C(Homo sapiens (Human))
Green Cross
Curated by ChEMBL
LigandPNGBDBM50313249(CHEMBL1080215 | N-(3-(4-(3-chlorophenyl)piperazin-...)
Affinity DataIC50:  280nM. Assay description: Displacement of [3H]mesulergine from human recombinant 5-HT2C receptor expressed in CHO-K1 cells after 60 mins by rapid filtration assay
In DepthDetails ArticlePubMed