BDBM50313272 CHEMBL1088314::N-(3-(4-(2,3-dichlorophenyl)piperazin-1-yl)propyl)-1-(4-fluorophenyl)-2-methyl-5-phenyl-1H-pyrrole-3-carboxamide
SMILES Cc1c(cc(-c2ccccc2)n1-c1ccc(F)cc1)C(=O)NCCCN1CCN(CC1)c1cccc(Cl)c1Cl
InChI Key InChIKey=HUDVPJBZHXPMCT-UHFFFAOYSA-N
Data  4 IC50
  Tab Delimited (TSV)   2D SDfile   Computed 3D by Vconf -m prep SDfile
Find this compound or compounds like it in BindingDB:
Activity Spreadsheet -- Enzyme Inhibition Constant Data from BindingDB
Found 4 hits for monomerid = 50313272
Target5-hydroxytryptamine receptor 2A(Homo sapiens (Human))
Green Cross
Curated by ChEMBL
LigandPNGBDBM50313272(CHEMBL1088314 | N-(3-(4-(2,3-dichlorophenyl)pipera...)
Affinity DataIC50:  4.10nM. Assay description: Displacement of [3H]ketanserin from human recombinant 5-HT2A receptor expressed in CHO-K1 cells after 60 mins
In DepthDetails ArticlePubMed
Target5-hydroxytryptamine receptor 7(Homo sapiens (Human))
Green Cross
Curated by ChEMBL
LigandPNGBDBM50313272(CHEMBL1088314 | N-(3-(4-(2,3-dichlorophenyl)pipera...)
Affinity DataIC50:  524nM. Assay description: Inhibition of 5HT7 receptor
In DepthDetails ArticlePubMed
TargetSodium-dependent serotonin transporter(Homo sapiens (Human))
Green Cross
Curated by ChEMBL
LigandPNGBDBM50313272(CHEMBL1088314 | N-(3-(4-(2,3-dichlorophenyl)pipera...)
Affinity DataIC50:  266nM. Assay description: Displacement of [3H]imipramine from human SERT expressed in HEK293 cells after 30 mins by rapid filtration assay
In DepthDetails ArticlePubMed
Target5-hydroxytryptamine receptor 2C(Homo sapiens (Human))
Green Cross
Curated by ChEMBL
LigandPNGBDBM50313272(CHEMBL1088314 | N-(3-(4-(2,3-dichlorophenyl)pipera...)
Affinity DataIC50:  466nM. Assay description: Displacement of [3H]mesulergine from human recombinant 5-HT2C receptor expressed in CHO-K1 cells after 60 mins by rapid filtration assay
In DepthDetails ArticlePubMed