BDBM50313277 CHEMBL1081035::N-(2-(4-(2,3-dichlorophenyl)piperazin-1-yl)ethyl)-2-methyl-5-phenyl-1-propyl-1H-pyrrole-3-carboxamide
SMILES CCCn1c(C)c(cc1-c1ccccc1)C(=O)NCCN1CCN(CC1)c1cccc(Cl)c1Cl
InChI Key InChIKey=LKLHQYZTMSNKTI-UHFFFAOYSA-N
Data  6 IC50
  Tab Delimited (TSV)   2D SDfile   Computed 3D by Vconf -m prep SDfile
Find this compound or compounds like it in BindingDB:
Activity Spreadsheet -- Enzyme Inhibition Constant Data from BindingDB
Found 6 hits for monomerid = 50313277
Target5-hydroxytryptamine receptor 2A(Homo sapiens (Human))
Green Cross
Curated by ChEMBL
LigandPNGBDBM50313277(CHEMBL1081035 | N-(2-(4-(2,3-dichlorophenyl)pipera...)
Affinity DataIC50:  408nM. Assay description: Displacement of [3H]ketanserin from human recombinant 5-HT2A receptor expressed in CHO-K1 cells after 60 mins
In DepthDetails ArticlePubMed
Target5-hydroxytryptamine receptor 2C(Homo sapiens (Human))
Green Cross
Curated by ChEMBL
LigandPNGBDBM50313277(CHEMBL1081035 | N-(2-(4-(2,3-dichlorophenyl)pipera...)
Affinity DataIC50:  310nM. Assay description: Displacement of [3H]mesulergine from human recombinant 5-HT2C receptor expressed in CHO-K1 cells after 60 mins by rapid filtration assay
In DepthDetails ArticlePubMed
TargetSodium-dependent serotonin transporter(Homo sapiens (Human))
Green Cross
Curated by ChEMBL
LigandPNGBDBM50313277(CHEMBL1081035 | N-(2-(4-(2,3-dichlorophenyl)pipera...)
Affinity DataIC50:  32nM. Assay description: Displacement of [3H]imipramine from human SERT expressed in HEK293 cells
In DepthDetails ArticlePubMed
Target5-hydroxytryptamine receptor 2A(Homo sapiens (Human))
Green Cross
Curated by ChEMBL
LigandPNGBDBM50313277(CHEMBL1081035 | N-(2-(4-(2,3-dichlorophenyl)pipera...)
Affinity DataIC50:  408nM. Assay description: Displacement of [3H]ketanserin from human recombinant 5HT2A expressed in CHOK1 cells
In DepthDetails ArticlePubMed
Target5-hydroxytryptamine receptor 2C(Homo sapiens (Human))
Green Cross
Curated by ChEMBL
LigandPNGBDBM50313277(CHEMBL1081035 | N-(2-(4-(2,3-dichlorophenyl)pipera...)
Affinity DataIC50:  310nM. Assay description: Displacement of [3H]mesulergine from human recombinant 5HT2C expressed in CHOK1 cells
In DepthDetails ArticlePubMed
TargetSodium-dependent serotonin transporter(Homo sapiens (Human))
Green Cross
Curated by ChEMBL
LigandPNGBDBM50313277(CHEMBL1081035 | N-(2-(4-(2,3-dichlorophenyl)pipera...)
Affinity DataIC50:  32nM. Assay description: Displacement of [3H]imipramine from human SERT expressed in HEK293 cells after 30 mins by rapid filtration assay
In DepthDetails ArticlePubMed