BDBM50313488 (S)-2-{[3-(4-nitro-benzenesulfonylamino)-thiophene-2-carbonyl]-amino}-5-guanidinopentanoic acid::(S)-5-guanidino-2-(3-(4-nitrophenylsulfonamido)thiophene-2-carboxamido)pentanoic acid::CHEMBL1079279
SMILES [#7]\[#6](-[#7])=[#7]\[#6]-[#6]-[#6]-[#6@H](-[#7]-[#6](=O)-c1sccc1-[#7]S(=O)(=O)c1ccc(cc1)-[#7+](-[#8-])=O)-[#6](-[#8])=O
InChI Key InChIKey=BRHWBVXFXBEJOE-ZDUSSCGKSA-N
Data  1 IC50
  Tab Delimited (TSV)   2D SDfile   Computed 3D by Vconf -m prep SDfile
Find this compound or compounds like it in BindingDB:
Activity Spreadsheet -- Enzyme Inhibition Constant Data from BindingDB
Found 1 hit for monomerid = 50313488
TargetNeuropilin-1(Homo sapiens (Human))
Domainex
Curated by ChEMBL
LigandPNGBDBM50313488((S)-2-{[3-(4-nitro-benzenesulfonylamino)-thiophene...)
Affinity DataIC50:  5.20E+4nM. Assay description: Displacement of [125I]VEGF-A from human NRP1 expressed in pig aortic endothelial cells
In DepthDetails ArticlePubMed