BDBM50315680 ((3S,4R)-4-(2,4-difluorophenyl)pyrrolidin-3-yl)((3S,4R,5R)-4-hydroxy-3,5-dimethyl-4-phenylpiperidin-1-yl)methanone::CHEMBL1092209
SMILES C[C@H]1CN(C[C@@H](C)[C@]1(O)c1ccccc1)C(=O)[C@@H]1CNC[C@H]1c1ccc(F)cc1F
InChI Key InChIKey=MXAUIAYYRYRHPY-NGZAGFBYSA-N
Data  2 KI  4 EC50
  Tab Delimited (TSV)   2D SDfile   Computed 3D by Vconf -m prep SDfile
Find this compound or compounds like it in BindingDB:
Activity Spreadsheet -- Enzyme Inhibition Constant Data from BindingDB
Found 6 hits for monomerid = 50315680
TargetPotassium voltage-gated channel subfamily H member 2(Homo sapiens (Human))
Pfizer
Curated by ChEMBL
LigandPNGBDBM50315680(((3S,4R)-4-(2,4-difluorophenyl)pyrrolidin-3-yl)((3...)
Affinity DataKi:  6.70nM. Assay description: Displacement of [3H]dofetilide from human ERG expressed in CHO cells by patch clamp method
In DepthDetails ArticlePubMed
TargetMelanocortin receptor 4(Homo sapiens (Human))
Pfizer
Curated by ChEMBL
LigandPNGBDBM50315680(((3S,4R)-4-(2,4-difluorophenyl)pyrrolidin-3-yl)((3...)
Affinity DataKi:  264nM. Assay description: Displacement of [3H] melanocortin-2 from human recombinant MC4 receptor expressed in CHO cells by scintillation counting
In DepthDetails ArticlePubMed
TargetMelanocyte-stimulating hormone receptor(Homo sapiens (Human))
Pfizer
Curated by ChEMBL
LigandPNGBDBM50315680(((3S,4R)-4-(2,4-difluorophenyl)pyrrolidin-3-yl)((3...)
Affinity DataEC50: >8.74E+3nM. Assay description: Agonist activity at human recombinant MC1 receptor expressed in HEK293 cells assessed as cAMP accumulation by enzyme fragment complementation assay
In DepthDetails ArticlePubMed
TargetMelanocortin receptor 4(Homo sapiens (Human))
Pfizer
Curated by ChEMBL
LigandPNGBDBM50315680(((3S,4R)-4-(2,4-difluorophenyl)pyrrolidin-3-yl)((3...)
Affinity DataEC50:  462nM. Assay description: Agonist activity at human recombinant MC4 receptor expressed in CHO cells by cAMP responsive beta lactamase reporter gene assay
In DepthDetails ArticlePubMed
TargetMelanocortin receptor 3(Homo sapiens (Human))
Pfizer
Curated by ChEMBL
LigandPNGBDBM50315680(((3S,4R)-4-(2,4-difluorophenyl)pyrrolidin-3-yl)((3...)
Affinity DataEC50: >2.52E+4nM. Assay description: Agonist activity at human recombinant MC3 receptor expressed in CHO cells assessed as cAMP accumulation by enzyme fragment complementation assay
In DepthDetails ArticlePubMed
TargetMelanocortin receptor 5(Homo sapiens (Human))
Pfizer
Curated by ChEMBL
LigandPNGBDBM50315680(((3S,4R)-4-(2,4-difluorophenyl)pyrrolidin-3-yl)((3...)
Affinity DataEC50: >2.00E+4nM. Assay description: Agonist activity at human recombinant MC5 receptor expressed in HEK293 cells assessed as cAMP accumulation by beta lactamase reporter gene assay
In DepthDetails ArticlePubMed