BDBM50316635 (2S)-N-[(2S,5S,11S,20S,23S,29S)-2,20-dibenzyl-29-[(2S)-2-(methylamino)propanamido]-4,10,22,28-tetraoxo-3,9,16,17,18,21,27,34,35,36-decaazapentacyclo[32.2.1.1^{16,19}.0^{5,9}.0^{23,27}]octatriaconta-1(37),17,19(38),35-tetraen-11-yl]-2-(methylamino)propanamide::CHEMBL1095994
SMILES CN[C@@H](C)C(=O)N[C@H]1CCCCn2cc(nn2)[C@H](Cc2ccccc2)NC(=O)[C@@H]2CCCN2C(=O)[C@H](CCCCn2cc(nn2)[C@H](Cc2ccccc2)NC(=O)[C@@H]2CCCN2C1=O)NC(=O)[C@H](C)NC
InChI Key InChIKey=TYNHJKLQRPJVGS-PSHIGVLGSA-N
Data  2 KI  3 IC50
  Tab Delimited (TSV)   2D SDfile   Computed 3D by Vconf -m prep SDfile
Find this compound or compounds like it in BindingDB:
Activity Spreadsheet -- Enzyme Inhibition Constant Data from BindingDB
Found 5 hits for monomerid = 50316635
TargetBaculoviral IAP repeat-containing protein 2(Homo sapiens (Human))
University Of Michigan
Curated by ChEMBL
LigandPNGBDBM50316635((2S)-N-[(2S,5S,11S,20S,23S,29S)-2,20-dibenzyl-29-[...)
Affinity DataKi:  161nM. Assay description: Binding affinity to cIAP1 BIR3 domain by fluorescence polarization assay
In DepthDetails ArticlePubMed
TargetBaculoviral IAP repeat-containing protein 3(Homo sapiens (Human))
University Of Michigan
Curated by ChEMBL
LigandPNGBDBM50316635((2S)-N-[(2S,5S,11S,20S,23S,29S)-2,20-dibenzyl-29-[...)
Affinity DataKi:  393nM. Assay description: Binding affinity to cIAP2 BIR3 domain by fluorescence polarization assay
In DepthDetails ArticlePubMed
TargetE3 ubiquitin-protein ligase XIAP(Homo sapiens (Human))
University Of Michigan
Curated by ChEMBL
LigandPNGBDBM50316635((2S)-N-[(2S,5S,11S,20S,23S,29S)-2,20-dibenzyl-29-[...)
Affinity DataIC50:  4.05E+4nM. Assay description: Binding affinity to XIAP linker BIR2 domain by fluorescence polarization assay
In DepthDetails ArticlePubMed
TargetE3 ubiquitin-protein ligase XIAP(Homo sapiens (Human))
University Of Michigan
Curated by ChEMBL
LigandPNGBDBM50316635((2S)-N-[(2S,5S,11S,20S,23S,29S)-2,20-dibenzyl-29-[...)
Affinity DataIC50:  1.30nM. Assay description: Binding affinity to XIAP linker BIR2-BIR3 domain site 1 by fluorescence polarization assay
In DepthDetails ArticlePubMed
TargetE3 ubiquitin-protein ligase XIAP(Homo sapiens (Human))
University Of Michigan
Curated by ChEMBL
LigandPNGBDBM50316635((2S)-N-[(2S,5S,11S,20S,23S,29S)-2,20-dibenzyl-29-[...)
Affinity DataIC50:  1.11E+3nM. Assay description: Binding affinity to XIAP linker BIR2-BIR3 domain site 2 by fluorescence polarization assay
In DepthDetails ArticlePubMed