BDBM50317209 (2R)-N-(adamantan-2-yl)-1-ethylpyrrolidine-2-carboxamide::CHEMBL1095047::PF-877423
SMILES CCN1CCC[C@@H]1C(=O)NC1C2CC3CC(C2)CC1C3
InChI Key InChIKey=UJRJQNDIYCDCNX-BAPHQMLMSA-N
Data  1 KI  4 IC50
PDB links: 1 PDB ID matches this monomer.
  Tab Delimited (TSV)   2D SDfile   Computed 3D by Vconf -m prep SDfile
Find this compound or compounds like it in BindingDB:
Activity Spreadsheet -- Enzyme Inhibition Constant Data from BindingDB
Found 5 hits for monomerid = 50317209
Target11-beta-hydroxysteroid dehydrogenase 1(Homo sapiens (Human))
Pfizer
Curated by ChEMBL
LigandPNGBDBM50317209((2R)-N-(adamantan-2-yl)-1-ethylpyrrolidine-2-carbo...)
Affinity DataKi:  1.40nM. Assay description: Inhibition of human 11-beta-HSD1
In DepthDetails ArticlePubMed
Target11-beta-hydroxysteroid dehydrogenase 1(Homo sapiens (Human))
Pfizer
Curated by ChEMBL
LigandPNGBDBM50317209((2R)-N-(adamantan-2-yl)-1-ethylpyrrolidine-2-carbo...)
Affinity DataIC50:  4nM. Assay description: Inhibition of 11beta-HSD1 in human liver microsomes assessed as conversion of [3H]-cortisone to [3H]-cortisol after 30 mins by scintillation proximit...
In DepthDetails ArticlePubMed
Target11-beta-hydroxysteroid dehydrogenase 1(Homo sapiens (Human))
Pfizer
Curated by ChEMBL
LigandPNGBDBM50317209((2R)-N-(adamantan-2-yl)-1-ethylpyrrolidine-2-carbo...)
Affinity DataIC50:  90nM. Assay description: Inhibition of 11beta-HSD1 in human liver microsomes using [3H]cortisone as substrate preincubated for 15 mins followed by substrate addition and meas...
In DepthDetails ArticlePubMed
Target11-beta-hydroxysteroid dehydrogenase 1(Homo sapiens (Human))
Pfizer
Curated by ChEMBL
LigandPNGBDBM50317209((2R)-N-(adamantan-2-yl)-1-ethylpyrrolidine-2-carbo...)
Affinity DataIC50:  4.15nM. Assay description: Inhibition of human 11-beta-HSD1 expressed in HEK293 cells co-transfected with GRE-luciferase after 6 hrs by luciferase reporter gene assay
In DepthDetails ArticlePubMed
Target11-beta-hydroxysteroid dehydrogenase 1(Homo sapiens (Human))
Pfizer
Curated by ChEMBL
LigandPNGBDBM50317209((2R)-N-(adamantan-2-yl)-1-ethylpyrrolidine-2-carbo...)
Affinity DataIC50:  4.10nM. Assay description: Inhibition of 11betaHSD1 expressed in HEK cells
In DepthDetails ArticlePubMed