BDBM50317599 5-(cyclopentyloxy)-N-(3,5-dichloropyridin-4-yl)-6-methoxyisoquinolin-1-amine::CHEMBL1098192
SMILES COc1ccc2c(Nc3c(Cl)cncc3Cl)nccc2c1OC1CCCC1
InChI Key InChIKey=PHIWHTOIEFIDDA-UHFFFAOYSA-N
Data  1 IC50
  Tab Delimited (TSV)   2D SDfile   Computed 3D by Vconf -m prep SDfile
Find this compound or compounds like it in BindingDB:
Activity Spreadsheet -- Enzyme Inhibition Constant Data from BindingDB
Found 1 hit for monomerid = 50317599
TargetcAMP-specific 3',5'-cyclic phosphodiesterase 4B(Homo sapiens (Human))
Kalypsys
Curated by ChEMBL
LigandPNGBDBM50317599(5-(cyclopentyloxy)-N-(3,5-dichloropyridin-4-yl)-6-...)
Affinity DataIC50:  500nM. Assay description: Inhibition of human His6-tagged PDE4B (152-487) expressed in Escherichia coli BL21 (DE3) after 1 hr
In DepthDetails ArticlePubMed