BDBM50317615 4-(3,5-dichloropyridin-4-ylamino)-8-(7-(dimethylamino)heptyloxy)-7-methoxy-2H-chromen-2-one::CHEMBL1099163
SMILES COc1ccc2c(Nc3c(Cl)cncc3Cl)cc(=O)oc2c1OCCCCCCCN(C)C
InChI Key InChIKey=GUZUKVRFWORJOY-UHFFFAOYSA-N
Data  1 IC50
  Tab Delimited (TSV)   2D SDfile   Computed 3D by Vconf -m prep SDfile
Find this compound or compounds like it in BindingDB:
Activity Spreadsheet -- Enzyme Inhibition Constant Data from BindingDB
Found 1 hit for monomerid = 50317615
TargetcAMP-specific 3',5'-cyclic phosphodiesterase 4B(Homo sapiens (Human))
Kalypsys
Curated by ChEMBL
LigandPNGBDBM50317615(4-(3,5-dichloropyridin-4-ylamino)-8-(7-(dimethylam...)
Affinity DataIC50:  3nM. Assay description: Inhibition of human His6-tagged PDE4B (152-487) expressed in Escherichia coli BL21 (DE3) after 1 hr
In DepthDetails ArticlePubMed