BDBM50318454 CHEMBL123040::Diallyl trisulfide::diallyltrisulfane
SMILES C=CCSSSCC=C
InChI Key InChIKey=UBAXRAHSPKWNCX-UHFFFAOYSA-N
Data  2 IC50  1 EC50
  Tab Delimited (TSV)   2D SDfile   Computed 3D by Vconf -m prep SDfile
Find this compound or compounds like it in BindingDB:
Activity Spreadsheet -- Enzyme Inhibition Constant Data from BindingDB
Found 3 hits for monomerid = 50318454
TargetFatty acid synthase(Gallus gallus (Chicken))
Graduate University of Chinese Academy of Sciences
LigandPNGBDBM50318454(CHEMBL123040 | Diallyl trisulfide | diallyltrisulf...)
Affinity DataIC50:  8.37E+3nMpH: 7.0 T: 2°C. Assay description: FAS activity was determined by monitoring the decrease in absorbence at 340 nm resulting from the oxidation of NADPH using an Amersham Pharmacia Ultr...
In DepthDetails ArticlePubMed
TargetTransient receptor potential cation channel subfamily A member 1(Homo sapiens (Human))
Ferrara University
Curated by ChEMBL
LigandPNGBDBM50318454(CHEMBL123040 | Diallyl trisulfide | diallyltrisulf...)
Affinity DataEC50:  490nM. Assay description: Agonist activity at human TRPA1 channel expressed in CHO cells assessed as increase in intracellular calcium levels
In DepthDetails ArticlePubMed
TargetFatty acid synthase(Gallus gallus (Chicken))
Graduate University of Chinese Academy of Sciences
LigandPNGBDBM50318454(CHEMBL123040 | Diallyl trisulfide | diallyltrisulf...)
Affinity DataIC50:  8.37E+3nM. Assay description: Inhibition of chicken liver FASN
In DepthDetails ArticlePubMed