BDBM50318655 (E)-4-(2-(3-bromobenzylidene)hydrazinyl)-N-(4-bromophenyl)-4-oxobutanamide::CHEMBL1083059
SMILES Brc1ccc(NC(=O)CCC(=O)N\N=C\c2cccc(Br)c2)cc1
InChI Key InChIKey=MMFAVAKWIQGBOA-RGVLZGJSSA-N
Data  1 IC50
  Tab Delimited (TSV)   2D SDfile   Computed 3D by Vconf -m prep SDfile
Find this compound or compounds like it in BindingDB:
Activity Spreadsheet -- Enzyme Inhibition Constant Data from BindingDB
Found 1 hit for monomerid = 50318655
TargetProbable nicotinate-nucleotide adenylyltransferase(Bacillus anthracis)
University Of Texas Southwestern Medical Center
Curated by ChEMBL
LigandPNGBDBM50318655((E)-4-(2-(3-bromobenzylidene)hydrazinyl)-N-(4-brom...)
Affinity DataIC50:  1.70E+5nM. Assay description: Inhibition of Bacillus anthracis nicotinate-nucleotide adenylyltransferase preincubated for 5 mins before addition of substrate by malachite green re...
In DepthDetails ArticlePubMed