BDBM50318657 (E)-2-(3,5-dibromo-4-methylphenylamino)-N'-(1-(2,4-dimethoxyphenyl)ethylidene)acetohydrazide::CHEMBL1082418
SMILES COc1ccc(C(C)=NNC(=O)CNc2cc(Br)c(C)c(Br)c2)c(OC)c1
InChI Key InChIKey=BTIABGWPLWNHPP-UHFFFAOYSA-N
Data  1 IC50
  Tab Delimited (TSV)   2D SDfile   Computed 3D by Vconf -m prep SDfile
Find this compound or compounds like it in BindingDB:
Activity Spreadsheet -- Enzyme Inhibition Constant Data from BindingDB
Found 1 hit for monomerid = 50318657
TargetProbable nicotinate-nucleotide adenylyltransferase(Bacillus anthracis)
University Of Texas Southwestern Medical Center
Curated by ChEMBL
LigandPNGBDBM50318657((E)-2-(3,5-dibromo-4-methylphenylamino)-N'-(1-(2,4...)
Affinity DataIC50:  3.00E+4nM. Assay description: Inhibition of Bacillus anthracis nicotinate-nucleotide adenylyltransferase preincubated for 5 mins before addition of substrate by malachite green re...
In DepthDetails ArticlePubMed