BDBM50318658 (E)-4-(2-(anthracen-9-ylmethylene)hydrazinyl)-N-(4-bromophenyl)-4-oxobutanamide::CHEMBL1084261
SMILES Brc1ccc(NC(=O)CCC(=O)N\N=C\c2c3ccccc3cc3ccccc23)cc1
InChI Key InChIKey=XUEFKKBWGQRORP-JVWAILMASA-N
Data  1 IC50
  Tab Delimited (TSV)   2D SDfile   Computed 3D by Vconf -m prep SDfile
Find this compound or compounds like it in BindingDB:
Activity Spreadsheet -- Enzyme Inhibition Constant Data from BindingDB
Found 1 hit for monomerid = 50318658
TargetProbable nicotinate-nucleotide adenylyltransferase(Bacillus anthracis)
University Of Texas Southwestern Medical Center
Curated by ChEMBL
LigandPNGBDBM50318658((E)-4-(2-(anthracen-9-ylmethylene)hydrazinyl)-N-(4...)
Affinity DataIC50:  3.30E+4nM. Assay description: Inhibition of Bacillus anthracis nicotinate-nucleotide adenylyltransferase preincubated for 5 mins before addition of substrate by malachite green re...
In DepthDetails ArticlePubMed