BDBM50319791 (4'-chloro-2-methoxy-2'-methylbiphenyl-4-yl)((1S,5R)-1,3,3-trimethyl-6-azabicyclo[3.2.1]octan-6-yl)methanone::CHEMBL1083444
SMILES COc1cc(ccc1-c1ccc(Cl)cc1C)C(=O)N1C[C@]2(C)C[C@H]1CC(C)(C)C2
InChI Key InChIKey=MVJHCHSVFFDHAX-KBMIEXCESA-N
Data  2 KI
  Tab Delimited (TSV)   2D SDfile   Computed 3D by Vconf -m prep SDfile
Find this compound or compounds like it in BindingDB:
Activity Spreadsheet -- Enzyme Inhibition Constant Data from BindingDB
Found 2 hits for monomerid = 50319791
TargetVasopressin V1a receptor(Homo sapiens (Human))
Pfizer
Curated by ChEMBL
LigandPNGBDBM50319791((4'-chloro-2-methoxy-2'-methylbiphenyl-4-yl)((1S,5...)
Affinity DataKi:  2.26nM. Assay description: Displacement [3H]Arg human recombinant Vasopressin V1a receptor
In DepthDetails ArticlePubMed
TargetVasopressin V2 receptor(Homo sapiens (Human))
Pfizer
Curated by ChEMBL
LigandPNGBDBM50319791((4'-chloro-2-methoxy-2'-methylbiphenyl-4-yl)((1S,5...)
Affinity DataKi:  291nM. Assay description: Displacement [3H]Arg human recombinant Vasopressin V2 receptor
In DepthDetails ArticlePubMed