BDBM50322103 3-(4-chlorophenylsulfonyl)-N-((tetrahydrofuran-2-yl)methyl)thieno[2,3-e][1,2,3]triazolo[1,5-a]pyrimidin-5-amine::CHEMBL1172866
SMILES Clc1ccc(cc1)S(=O)(=O)c1nnn2c3ccsc3c(NCC3CCCO3)nc12
InChI Key InChIKey=UWAOFCDQBWBLQX-UHFFFAOYSA-N
Data  1 IC50
  Tab Delimited (TSV)   2D SDfile   Computed 3D by Vconf -m prep SDfile
Find this compound or compounds like it in BindingDB:
Activity Spreadsheet -- Enzyme Inhibition Constant Data from BindingDB
Found 1 hit for monomerid = 50322103
Target5-hydroxytryptamine receptor 6(Homo sapiens (Human))
Chemical Diversity Research Institute
Curated by ChEMBL
LigandPNGBDBM50322103(3-(4-chlorophenylsulfonyl)-N-((tetrahydrofuran-2-y...)
Affinity DataIC50:  480nM. Assay description: Antagonist activity at human recombinant 5HT6 receptor expressed in HEK293 cells assessed as inhibition of serotonin-induced cAMP production
In DepthDetails ArticlePubMed