BDBM50322200 3-(4-chlorophenylsulfonyl)-N-(2-methoxyethyl)thieno[2,3-e][1,2,3]triazolo[1,5-a]pyrimidin-5-amine::CHEMBL1173434
SMILES COCCNc1nc2c(nnn2c2ccsc12)S(=O)(=O)c1ccc(Cl)cc1
InChI Key InChIKey=RAXAXXFWCBUIDW-UHFFFAOYSA-N
Data  1 IC50
  Tab Delimited (TSV)   2D SDfile   Computed 3D by Vconf -m prep SDfile
Find this compound or compounds like it in BindingDB:
Activity Spreadsheet -- Enzyme Inhibition Constant Data from BindingDB
Found 1 hit for monomerid = 50322200
Target5-hydroxytryptamine receptor 6(Homo sapiens (Human))
Chemical Diversity Research Institute
Curated by ChEMBL
LigandPNGBDBM50322200(3-(4-chlorophenylsulfonyl)-N-(2-methoxyethyl)thien...)
Affinity DataIC50:  2.17E+3nM. Assay description: Antagonist activity at human recombinant 5HT6 receptor expressed in HEK293 cells assessed as inhibition of serotonin-induced cAMP production
In DepthDetails ArticlePubMed