BDBM50322474 (S)-5-(4-chlorophenylamino)-2-((R)-4-((3R,5R,7R,8R,9S,10S,13R,14S,17R)-3,7-dihydroxy-10,13-dimethylhexadecahydro-1H-cyclopenta[a]phenanthren-17-yl)pentanamido)-5-oxopentanoate::CHEMBL1170054
SMILES C[C@H](CCC(=O)N[C@@H](CCC(=O)Nc1ccc(Cl)cc1)C(O)=O)[C@H]1CC[C@H]2[C@@H]3[C@H](O)C[C@H]4C[C@H](O)CC[C@]4(C)[C@H]3CC[C@]12C
InChI Key InChIKey=JTZKJNWNRDCOKS-BPBHNCSOSA-N
Data  1 KI
  Tab Delimited (TSV)   2D SDfile   Computed 3D by Vconf -m prep SDfile
Find this compound or compounds like it in BindingDB:
Activity Spreadsheet -- Enzyme Inhibition Constant Data from BindingDB
Found 1 hit for monomerid = 50322474
TargetIleal sodium/bile acid cotransporter(Homo sapiens (Human))
University Of Maryland
Curated by ChEMBL
LigandPNGBDBM50322474((S)-5-(4-chlorophenylamino)-2-((R)-4-((3R,5R,7R,8R...)
Affinity DataKi:  1.91E+3nM. Assay description: Inhibition of human ASBT expressed in MDCK cells assessed as inhibition of [3H]taurocholic acid uptake after 10 mins by liquid scintillation counting
In DepthDetails ArticlePubMed