BDBM50322481 (2S)-2-((4R)-4-((3R,7R,8R,9S,10S,13R,14S,17R)-3,7-dihydroxy-10,13-dimethylhexadecahydro-1H-cyclopenta[a]phenanthren-17-yl)pentanamido)-5-(4-(ethoxycarbonyl)phenylamino)-5-oxopentanoate::CHEMBL3138511
SMILES CCOC(=O)c1ccc(NC(=O)CCC(NC(=O)CCC(C)C2CCC3C4C(O)CC5CC(O)CCC5(C)C4CCC23C)C(O)=O)cc1
InChI Key InChIKey=GXHGBCQYCGPGDC-FNCSIKOGSA-N
Data  1 KI
  Tab Delimited (TSV)   2D SDfile   Computed 3D by Vconf -m prep SDfile
Find this compound or compounds like it in BindingDB:
Activity Spreadsheet -- Enzyme Inhibition Constant Data from BindingDB
Found 1 hit for monomerid = 50322481
TargetIleal sodium/bile acid cotransporter(Homo sapiens (Human))
University Of Maryland
Curated by ChEMBL
LigandPNGBDBM50322481((2S)-2-((4R)-4-((3R,7R,8R,9S,10S,13R,14S,17R)-3,7-...)
Affinity DataKi:  5.16E+3nM. Assay description: Inhibition of human ASBT expressed in MDCK cells assessed as inhibition of [3H]taurocholic acid uptake after 10 mins by liquid scintillation counting
In DepthDetails ArticlePubMed