BDBM50322483 (2S)-5-(4-(tert-butoxycarbonylamino)phenylamino)-2-((4R)-4-((3R,7R,8R,9S,10S,13R,14S,17R)-3,7-dihydroxy-10,13-dimethylhexadecahydro-1H-cyclopenta[a]phenanthren-17-yl)pentanamido)-5-oxopentanoate::CHEMBL3138503
SMILES CC(CCC(=O)NC(CCC(=O)Nc1ccc(NC(=O)OC(C)(C)C)cc1)C(O)=O)C1CCC2C3C(O)CC4CC(O)CCC4(C)C3CCC12C
InChI Key InChIKey=ZUGUPKBOHCFYIT-JKOYTMKXSA-N
Data  1 KI
  Tab Delimited (TSV)   2D SDfile   Computed 3D by Vconf -m prep SDfile
Find this compound or compounds like it in BindingDB:
Activity Spreadsheet -- Enzyme Inhibition Constant Data from BindingDB
Found 1 hit for monomerid = 50322483
TargetIleal sodium/bile acid cotransporter(Homo sapiens (Human))
University Of Maryland
Curated by ChEMBL
LigandPNGBDBM50322483((2S)-5-(4-(tert-butoxycarbonylamino)phenylamino)-2...)
Affinity DataKi:  5.26E+3nM. Assay description: Inhibition of human ASBT expressed in MDCK cells assessed as inhibition of [3H]taurocholic acid uptake after 10 mins by liquid scintillation counting
In DepthDetails ArticlePubMed