BDBM50323069 1-(3-(4-methoxyphenyl)-5-phenyl-4,5-dihydro-1H-pyrazol-1-yl)ethanone::CHEMBL1210920
SMILES COc1ccc(cc1)C1=NN(C(C1)c1ccccc1)C(C)=O
InChI Key InChIKey=NJNSUAFGXKWRID-UHFFFAOYSA-N
Data  1 IC50
  Tab Delimited (TSV)   2D SDfile   Computed 3D by Vconf -m prep SDfile
Find this compound or compounds like it in BindingDB:
Activity Spreadsheet -- Enzyme Inhibition Constant Data from BindingDB
Found 1 hit for monomerid = 50323069
Target3-oxoacyl-[acyl-carrier-protein] synthase 3(Escherichia coli)
Nanjing University
Curated by ChEMBL
LigandPNGBDBM50323069(1-(3-(4-methoxyphenyl)-5-phenyl-4,5-dihydro-1H-pyr...)
Affinity DataIC50:  4.67E+4nM. Assay description: Inhibition of Escherichia coli FabH
In DepthDetails ArticlePubMed