BDBM50324200 4-[(5R)-1-(3-Chloro-4-cyanophenyl)-5-cyclopentyl-4,5-dihydro-1H-pyrazol-3-yl]-3-methoxybenzoic Acid::CHEMBL1215196
SMILES COc1cc(ccc1C1=NN([C@H](C1)C1CCCC1)c1ccc(C#N)c(Cl)c1)C(O)=O
InChI Key InChIKey=JBFBMMXMFHQWEV-OAQYLSRUSA-N
Data  1 IC50
  Tab Delimited (TSV)   2D SDfile   Computed 3D by Vconf -m prep SDfile
Find this compound or compounds like it in BindingDB:
Activity Spreadsheet -- Enzyme Inhibition Constant Data from BindingDB
Found 1 hit for monomerid = 50324200
TargetMineralocorticoid receptor(Homo sapiens (Human))
Pfizer
Curated by ChEMBL
LigandPNGBDBM50324200(4-[(5R)-1-(3-Chloro-4-cyanophenyl)-5-cyclopentyl-4...)
Affinity DataIC50:  2nM. Assay description: Antagonist activity at Gal4-tagged mineralocorticoid receptor expressed in human Huh7 cells by luciferase reporter gene assay
In DepthDetails ArticlePubMed