BDBM50324558 2-[4-(4-Bromo-1-methyl-1H-pyrazole-3-carbonyl)piperazin-1-yl]-1-(4-trifluoromethoxyphenyl)ethanone::CHEMBL1214807
SMILES Cn1cc(Br)c(n1)C(=O)N1CCN(CC(=O)c2ccc(OC(F)(F)F)cc2)CC1
InChI Key InChIKey=RVWHJEXFBMRDTL-UHFFFAOYSA-N
Data  2 KI
  Tab Delimited (TSV)   2D SDfile   Computed 3D by Vconf -m prep SDfile
Find this compound or compounds like it in BindingDB:
Activity Spreadsheet -- Enzyme Inhibition Constant Data from BindingDB
Found 2 hits for monomerid = 50324558
Target5-hydroxytryptamine receptor 2C(Homo sapiens (Human))
Arena Pharmaceuticals
Curated by ChEMBL
LigandPNGBDBM50324558(2-[4-(4-Bromo-1-methyl-1H-pyrazole-3-carbonyl)pipe...)
Affinity DataKi:  5.61E+3nM. Assay description: Displacement of [125I]DOI from human recombinant 5HT2C receptor expressed in HEK293 cells after 1 hr by scintillation counting
In DepthDetails ArticlePubMed
Target5-hydroxytryptamine receptor 2A(Homo sapiens (Human))
Arena Pharmaceuticals
Curated by ChEMBL
LigandPNGBDBM50324558(2-[4-(4-Bromo-1-methyl-1H-pyrazole-3-carbonyl)pipe...)
Affinity DataKi:  6.00E+3nM. Assay description: Displacement of [125I]DOI from human recombinant 5HT2A receptor expressed in HEK293 cells after 1 hr by scintillation counting
In DepthDetails ArticlePubMed