BDBM50324918 (S)-3-(2-amino-5-chloro-1H-benzo[d]imidazol-1-yl)-N-isopropylpentanamide::CHEMBL1222236
SMILES CC[C@@H](CC(=O)NC(C)C)n1c(N)nc2cc(Cl)ccc12
InChI Key InChIKey=RXUAKNXAMROXDH-NSHDSACASA-N
Data  1 IC50
  Tab Delimited (TSV)   2D SDfile   Computed 3D by Vconf -m prep SDfile
Find this compound or compounds like it in BindingDB:
Activity Spreadsheet -- Enzyme Inhibition Constant Data from BindingDB
Found 1 hit for monomerid = 50324918
TargetBeta-secretase 1(Homo sapiens (Human))
Evotec
Curated by ChEMBL
LigandPNGBDBM50324918((S)-3-(2-amino-5-chloro-1H-benzo[d]imidazol-1-yl)-...)
Affinity DataIC50:  6.95E+5nM. Assay description: Inhibition of BACE1 assessed as amyloid beta secretion by cell based assay
In DepthDetails ArticlePubMed