BDBM50325092 4-(4-((1-benzyl-1H-tetrazol-5-yl)(4-cyclobutyl-1,4-diazepan-1-yl)methyl)phenyl)-2-methylthiazole::CHEMBL1222501
SMILES Cc1nc(cs1)-c1ccc(cc1)C(N1CCCN(CC1)C1CCC1)c1nnnn1Cc1ccccc1
InChI Key InChIKey=FGEZCXSLGZDZKQ-UHFFFAOYSA-N
Data  1 IC50
  Tab Delimited (TSV)   2D SDfile   Computed 3D by Vconf -m prep SDfile
Find this compound or compounds like it in BindingDB:
Activity Spreadsheet -- Enzyme Inhibition Constant Data from BindingDB
Found 1 hit for monomerid = 50325092
TargetHistamine H3 receptor(Homo sapiens (Human))
Evotec (Uk)
Curated by ChEMBL
LigandPNGBDBM50325092(4-(4-((1-benzyl-1H-tetrazol-5-yl)(4-cyclobutyl-1,4...)
Affinity DataIC50:  0.400nM. Assay description: Antagonist activity at human histamine H3 receptor
In DepthDetails ArticlePubMed