BDBM50325094 1-((4-((1H-pyrazol-1-yl)methyl)phenyl)(1-benzyl-1H-tetrazol-5-yl)methyl)-4-cyclobutyl-1,4-diazepane::CHEMBL1222593
SMILES C(c1ccc(cc1)C(N1CCCN(CC1)C1CCC1)c1nnnn1Cc1ccccc1)n1cccn1
InChI Key InChIKey=XZALYZZHWXOXQO-UHFFFAOYSA-N
Data  1 IC50
  Tab Delimited (TSV)   2D SDfile   Computed 3D by Vconf -m prep SDfile
Find this compound or compounds like it in BindingDB:
Activity Spreadsheet -- Enzyme Inhibition Constant Data from BindingDB
Found 1 hit for monomerid = 50325094
TargetHistamine H3 receptor(Homo sapiens (Human))
Evotec (Uk)
Curated by ChEMBL
LigandPNGBDBM50325094(1-((4-((1H-pyrazol-1-yl)methyl)phenyl)(1-benzyl-1H...)
Affinity DataIC50:  0.700nM. Assay description: Antagonist activity at human histamine H3 receptor
In DepthDetails ArticlePubMed