BDBM50325548 CHEMBL1224312::S-(4-Chlorobenzyl)isothiourea hydrochloride
SMILES NC(=N)SCc1ccc(Cl)cc1
InChI Key InChIKey=YOCWIHYZDHPSHD-UHFFFAOYSA-N
Data  2 IC50
PDB links: 4 PDB IDs match this monomer.
  Tab Delimited (TSV)   2D SDfile   Computed 3D by Vconf -m prep SDfile
Find this compound or compounds like it in BindingDB:
Activity Spreadsheet -- Enzyme Inhibition Constant Data from BindingDB
Found 2 hits for monomerid = 50325548
TargetIndoleamine 2,3-dioxygenase 1(Homo sapiens (Human))
University Of Shizuoka
Curated by ChEMBL
LigandPNGBDBM50325548(CHEMBL1224312 | S-(4-Chlorobenzyl)isothiourea hydr...)
Affinity DataIC50:  600nM. Assay description: Inhibition of indoleamine-2,3-dioxygenase in human A431 cells assessed as inhibition of IFN-gamma-stimulated kynurenine production
In DepthDetails ArticlePubMed
TargetIndoleamine 2,3-dioxygenase 1(Homo sapiens (Human))
University Of Shizuoka
Curated by ChEMBL
LigandPNGBDBM50325548(CHEMBL1224312 | S-(4-Chlorobenzyl)isothiourea hydr...)
Affinity DataIC50:  2.20E+3nM. Assay description: Inhibition of indoleamine-2,3-dioxygenase
In DepthDetails ArticlePubMed