BDBM50325551 4-tert-butylbenzyl carbamimidothioate hydrobromide::CHEMBL1224392
SMILES CC(C)(C)c1ccc(CSC(N)=N)cc1
InChI Key InChIKey=FCYJFUBBEMGBSN-UHFFFAOYSA-N
Data  2 IC50
  Tab Delimited (TSV)   2D SDfile   Computed 3D by Vconf -m prep SDfile
Find this compound or compounds like it in BindingDB:
Activity Spreadsheet -- Enzyme Inhibition Constant Data from BindingDB
Found 2 hits for monomerid = 50325551
TargetIndoleamine 2,3-dioxygenase 1(Homo sapiens (Human))
University Of Shizuoka
Curated by ChEMBL
LigandPNGBDBM50325551(4-tert-butylbenzyl carbamimidothioate hydrobromide...)
Affinity DataIC50: >2.00E+4nM. Assay description: Inhibition of indoleamine-2,3-dioxygenase in human A431 cells assessed as inhibition of IFN-gamma-stimulated kynurenine production
In DepthDetails ArticlePubMed
TargetIndoleamine 2,3-dioxygenase 1(Homo sapiens (Human))
University Of Shizuoka
Curated by ChEMBL
LigandPNGBDBM50325551(4-tert-butylbenzyl carbamimidothioate hydrobromide...)
Affinity DataIC50: >1.00E+5nM. Assay description: Inhibition of indoleamine-2,3-dioxygenase
In DepthDetails ArticlePubMed