BDBM50326378 (2S)-1-{(2S,4S)-4-[2-(5-Fluoro-1,3-dihydroisoindol-2-yl)-2-oxoethyl]-5-oxopyrrolidine-2-carbonyl}pyrrolidine-2-carbonitrile::CHEMBL1242940
SMILES Fc1ccc2CN(Cc2c1)C(=O)C[C@@H]1C[C@H](NC1=O)C(=O)N1CCC[C@H]1C#N
InChI Key InChIKey=MRFBMINIRVQNFI-JQFCIGGWSA-N
Data  5 IC50
  Tab Delimited (TSV)   2D SDfile   Computed 3D by Vconf -m prep SDfile
Find this compound or compounds like it in BindingDB:
Activity Spreadsheet -- Enzyme Inhibition Constant Data from BindingDB
Found 5 hits for monomerid = 50326378
TargetProlyl endopeptidase FAP(Homo sapiens (Human))
National Health Research Institutes
Curated by ChEMBL
LigandPNGBDBM50326378((2S)-1-{(2S,4S)-4-[2-(5-Fluoro-1,3-dihydroisoindol...)
Affinity DataIC50:  59nM. Assay description: Inhibition of human recombinant FAP expressed in Hi5 insect cells
In DepthDetails ArticlePubMed
TargetDipeptidyl peptidase 8(Homo sapiens (Human))
National Health Research Institutes
Curated by ChEMBL
LigandPNGBDBM50326378((2S)-1-{(2S,4S)-4-[2-(5-Fluoro-1,3-dihydroisoindol...)
Affinity DataIC50: >1.00E+5nM. Assay description: Inhibition of human recombinant His-tagged DPP8 expressed in insect cells
In DepthDetails ArticlePubMed
TargetDipeptidyl peptidase 4(Homo sapiens (Human))
National Health Research Institutes
Curated by ChEMBL
LigandPNGBDBM50326378((2S)-1-{(2S,4S)-4-[2-(5-Fluoro-1,3-dihydroisoindol...)
Affinity DataIC50: >1.00E+5nM. Assay description: Inhibition of human recombinant His-tagged DPP4 expressed in insect cells
In DepthDetails ArticlePubMed
TargetDipeptidyl peptidase 2(Homo sapiens (Human))
National Health Research Institutes
Curated by ChEMBL
LigandPNGBDBM50326378((2S)-1-{(2S,4S)-4-[2-(5-Fluoro-1,3-dihydroisoindol...)
Affinity DataIC50: >1.00E+5nM. Assay description: Inhibition of human recombinant His-tagged DPP2 expressed in insect cells
In DepthDetails ArticlePubMed
TargetDipeptidyl peptidase 9(Homo sapiens (Human))
National Health Research Institutes
Curated by ChEMBL
LigandPNGBDBM50326378((2S)-1-{(2S,4S)-4-[2-(5-Fluoro-1,3-dihydroisoindol...)
Affinity DataIC50: >1.00E+5nM. Assay description: Inhibition of human recombinant His-tagged DPP9 expressed in insect cells
In DepthDetails ArticlePubMed