BDBM50327402 5-(6-(2-ethoxyphenyl)-2-(pyridin-2-yl)pyrimidin-4-yl)-N-propylthiazol-2-amine::CHEMBL1258294
SMILES CCCNc1ncc(s1)-c1cc(nc(n1)-c1ccccn1)-c1ccccc1OCC
InChI Key InChIKey=FUNXZJWLKSWALG-UHFFFAOYSA-N
Data  1 IC50
  Tab Delimited (TSV)   2D SDfile   Computed 3D by Vconf -m prep SDfile
Find this compound or compounds like it in BindingDB:
Activity Spreadsheet -- Enzyme Inhibition Constant Data from BindingDB
Found 1 hit for monomerid = 50327402
TargetMitogen-activated protein kinase 14(Homo sapiens (Human))
Bristol-Myers Squibb Pharmaceutical Research Institute
Curated by ChEMBL
LigandPNGBDBM50327402(5-(6-(2-ethoxyphenyl)-2-(pyridin-2-yl)pyrimidin-4-...)
Affinity DataIC50:  859nM. Assay description: Inhibition of bacterially expressed activated p38alpha pre-incubated 10 mins measured after 45 mins by scintillation counting
In DepthDetails ArticlePubMed