BDBM50327840 1-(1-Propionylpiperidin-4-yl)-3-(3,4,5-trimethoxyphenyl)urea::CHEMBL1257990::US9296693, 18
SMILES CCC(=O)N1CCC(CC1)NC(=O)Nc1cc(OC)c(OC)c(OC)c1
InChI Key InChIKey=YMDWTTKRMUCZQB-UHFFFAOYSA-N
Data  4 IC50
  Tab Delimited (TSV)   2D SDfile   Computed 3D by Vconf -m prep SDfile
Find this compound or compounds like it in BindingDB:
Activity Spreadsheet -- Enzyme Inhibition Constant Data from BindingDB
Found 4 hits for monomerid = 50327840
TargetBifunctional epoxide hydrolase 2(Homo sapiens (Human))
The Regents of The University of California
US Patent
LigandPNGBDBM50327840(1-(1-Propionylpiperidin-4-yl)-3-(3,4,5-trimethoxyp...)
Affinity DataIC50: >5.00E+3nMpH: 7.0Assay Description:IC50 values were determined using a sensitive fluorescent based assay (Anal. Biochem. 2005, 343, 66-75). Cyano(2-methoxynaphthalen-6-yl)methyl trans-...
In DepthDetails US Patent
TargetBifunctional epoxide hydrolase 2(Mus musculus (Mouse))
Department Of Entomology And University Of California Davis Cancer Center
Curated by ChEMBL
LigandPNGBDBM50327840(1-(1-Propionylpiperidin-4-yl)-3-(3,4,5-trimethoxyp...)
Affinity DataIC50: >5.00E+3nM. Assay description: Inhibition of mouse recombinant soluble epoxide hydrolase by fluorescence assay
In DepthDetails ArticlePubMed
TargetBifunctional epoxide hydrolase 2(Homo sapiens (Human))
The Regents of The University of California
US Patent
LigandPNGBDBM50327840(1-(1-Propionylpiperidin-4-yl)-3-(3,4,5-trimethoxyp...)
Affinity DataIC50: >5.00E+3nM. Assay description: Inhibition of human recombinant soluble epoxide hydrolase by fluorescence assay
In DepthDetails ArticlePubMed
TargetBifunctional epoxide hydrolase 2(Mus musculus (Mouse))
Department Of Entomology And University Of California Davis Cancer Center
Curated by ChEMBL
LigandPNGBDBM50327840(1-(1-Propionylpiperidin-4-yl)-3-(3,4,5-trimethoxyp...)
Affinity DataIC50:  2.50E+4nMpH: 7.0Assay Description:IC50 values were determined using a sensitive fluorescent based assay (Anal. Biochem. 2005, 343, 66-75). Cyano(2-methoxynaphthalen-6-yl)methyl trans-...
In DepthDetails US Patent